{"text_format":"1","workbook":"xlsx","n_sheets":4,"sheets":["Intructions","Redeck Deflections","Deliverables","Reference"],"not_rendered":{"charts":0,"images":0,"macros":1,"external_links":0,"defined_names":1,"comments":0,"pivot_tables":0},"unopened":[],"bounds":{"document_bytes":16777216,"sheet_cells":100000,"rows_first":2000,"rows_last":500,"rows_between":2000,"halvings":0,"cell_chars":16384,"cell_head_chars":4096},"cells_cut":0,"cells_raw":0,"read":"whole","date_system":"1900"}

{"sheet":"Intructions","index":0,"n_rows":5,"n_cols":1,"rows_kept":5,"cut":false,"hidden":false,"merged":[]}
["1. Use the \"Clear Spreadsheet\" Button on the \"Redeck Deflections\" sheet when starting a new job."]
["2. Enter the number of spans and span lengths in the \"Redeck Deflections\" sheet and click on the \"Genereate Deflections Table\" button."]
["3. Copy and paste the deflections from AASHTOWare Bridge Rating to the spreadsheet table."]
["4. Go to the \"Deliverables\" sheet and click the \"Generate Deflections\" Button."]
["5. Copy the Data on the \"Deliverables\" sheet to a blank spreadsheet. This information will be shared in the electronic deliverables."]

{"sheet":"Redeck Deflections","index":1,"n_rows":43,"n_cols":30,"rows_kept":43,"cut":false,"hidden":false,"merged":[[0,0,1,9],[7,7,7,17],[7,19,7,29],[8,12,8,13],[8,15,8,16],[8,24,8,25],[8,27,8,28]]}
["Dead Load Deflections"]
[]
[null,null,"Number of Spans = ",3]
[]
[null,null,null,{"$f":"IF($D$3=1,\"Span 1\",IF($D$3=2,\"Span 1\",IF($D$3=3,\"Span 1\",IF($D$3=4,\"Span 1\",IF($D$3=5,\"Span 1\",IF($D$3=6,\"Span 1\",IF($D$3=7,\"Span 1\",IF($D$3=8,\"Span 1\",\"\"))))))))","v":"Span 1"},{"$f":"IF($D$3=1,\"\",IF($D$3=2,\"Span 2\",IF($D$3=3,\"Span 2\",IF($D$3=4,\"Span 2\",IF($D$3=5,\"Span 2\",IF($D$3=6,\"Span 2\",IF($D$3=7,\"Span 2\",IF($D$3=8,\"Span 2\",\"\"))))))))","v":"Span 2"},{"$f":"IF($D$3=1,\"\",IF($D$3=2,\"\",IF($D$3=3,\"Span 3\",IF($D$3=4,\"Span 3\",IF($D$3=5,\"Span 3\",IF($D$3=6,\"Span 3\",IF($D$3=7,\"Span 3\",IF($D$3=8,\"Span 3\",\"\"))))))))","v":"Span 3"},{"$f":"IF($D$3=1,\"\",IF($D$3=2,\"\",IF($D$3=3,\"\",IF($D$3=4,\"Span 4\",IF($D$3=5,\"Span 4\",IF($D$3=6,\"Span 4\",IF($D$3=7,\"Span 4\",IF($D$3=8,\"Span 4\",\"\"))))))))","v":""},{"$f":"IF($D$3=1,\"\",IF($D$3=2,\"\",IF($D$3=3,\"\",IF($D$3=4,\"\",IF($D$3=5,\"Span 5\",IF($D$3=6,\"Span 5\",IF($D$3=7,\"Span 5\",IF($D$3=8,\"Span 5\",\"\"))))))))","v":""},{"$f":"IF($D$3=1,\"\",IF($D$3=2,\"\",IF($D$3=3,\"\",IF($D$3=4,\"\",IF($D$3=5,\"\",IF($D$3=6,\"Span 6\",IF($D$3=7,\"Span 6\",IF($D$3=8,\"Span 6\",\"\"))))))))","v":""},{"$f":"IF($D$3=1,\"\",IF($D$3=2,\"\",IF($D$3=3,\"\",IF($D$3=4,\"\",IF($D$3=5,\"\",IF($D$3=6,\"\",IF($D$3=7,\"Span 7\",IF($D$3=8,\"Span 7\",\"\"))))))))","v":""},{"$f":"IF($D$3=1,\"\",IF($D$3=2,\"\",IF($D$3=3,\"\",IF($D$3=4,\"\",IF($D$3=5,\"\",IF($D$3=6,\"\",IF($D$3=7,\"\",IF($D$3=8,\"Span 8\",\"\"))))))))","v":""}]
[null,null,"Span Length, ft. = ",110,120,110]
[]
[null,null,null,null,null,null,null,"EXTERIOR GIRDERS",null,null,null,null,null,null,null,null,null,null,null,"INTERIOR GIRDERS"]
[null,null,null,null,null,null,null,null,null,null,"Girder","Intermediate diaphragms","Concrete",null,"Barrier","Total DL Deflection",null,null,null,null,null,null,"Girder","Intermediate diaphragms","Concrete",null,"Barrier","Total DL Deflection"]
[null,null,null,null,null,null,null,"Tenth point"," Location"," Distance"," YDL-s1- Load Case 1 - Self Load (Stage1:D,DC)"," YDL-s1- Load Case 2 - Add'l Self Load (In Force/Length) (Stage 1:D,DC)"," YDL-s1- Load Case 3 - Haunch Load (Stage1:D,DC)"," YDL-s1- Load Case 4 - Concrete Deck Load (Stage1:D,DC)"," YDL-s2- Load Case 1 - Parapet Loads(DL2 - Barriers & Curbs: Stage 2:D,D~","Decimal Inches","Nearest 1/8\"","Tenth point",null,"Tenth point"," Location"," Distance"," YDL-s1- Load Case 1 - Self Load (Stage1:D,DC)"," YDL-s1- Load Case 2 - Add'l Self Load (In Force/Length) (Stage 1:D,DC)"," YDL-s1- Load Case 3 - Haunch Load (Stage1:D,DC)"," YDL-s1- Load Case 4 - Concrete Deck Load (Stage1:D,DC)"," YDL-s2- Load Case 1 - Parapet Loads(DL2 - Barriers & Curbs: Stage 2:D,D~","Decimal Inches","Nearest 1/8\"","Tenth point"]
[null,null,null,null,null,null,null,1,0,0,0,0,0,0,0,{"$f":"SUM('Redeck Deflections'!$K$11:$O$11)","v":0},{"$f":"IF('Redeck Deflections'!$P$11<0,MROUND(ABS('Redeck Deflections'!$P$11),0.125),MROUND('Redeck Deflections'!$P$11,0.125)*-1)","v":0},1,null,1,0,0,0,0,0,0,0,{"$f":"SUM('Redeck Deflections'!$W$11:$AA$11)","v":0},{"$f":"IF('Redeck Deflections'!$AB$11<0,MROUND(ABS('Redeck Deflections'!$AB$11),0.125),MROUND('Redeck Deflections'!$AB$11,0.125)*-1)","v":0},1]
[null,null,null,null,null,null,null,1.1000000000000001,{"$f":"'Redeck Deflections'!$D$6*0.1","v":11},{"$f":"Reference!$C$349","v":11},-1.5699999999999999E-2,-7.4000000000000003E-3,-8.9999999999999998E-4,-0.12970000000000001,-2.4400000000000002E-2,{"$f":"SUM('Redeck Deflections'!$K$12:$O$12)","v":-0.17810000000000001},{"$f":"IF('Redeck Deflections'!$P$12<0,MROUND(ABS('Redeck Deflections'!$P$12),0.125),MROUND('Redeck Deflections'!$P$12,0.125)*-1)","v":0.125},1.1000000000000001,null,1.1000000000000001,{"$f":"'Redeck Deflections'!$D$6*0.1","v":11},{"$f":"Reference!$C$349","v":11},-1.5699999999999999E-2,-7.4000000000000003E-3,-8.9999999999999998E-4,-0.12970000000000001,-2.4400000000000002E-2,{"$f":"SUM('Redeck Deflections'!$W$12:$AA$12)","v":-0.17810000000000001},{"$f":"IF('Redeck Deflections'!$AB$12<0,MROUND(ABS('Redeck Deflections'!$AB$12),0.125),MROUND('Redeck Deflections'!$AB$12,0.125)*-1)","v":0.125},1.1000000000000001]
[null,null,null,null,null,null,null,1.2,{"$f":"'Redeck Deflections'!$D$6*0.2","v":22},{"$f":"Reference!$D$349+Reference!$D$349","v":22},-2.87E-2,-1.35E-2,-1.6999999999999999E-3,-0.23680000000000001,-4.4900000000000002E-2,{"$f":"SUM('Redeck Deflections'!$K$13:$O$13)","v":-0.3256},{"$f":"IF('Redeck Deflections'!$P$13<0,MROUND(ABS('Redeck Deflections'!$P$13),0.125),MROUND('Redeck Deflections'!$P$13,0.125)*-1)","v":0.375},1.2,null,1.2,{"$f":"'Redeck Deflections'!$D$6*0.2","v":22},{"$f":"Reference!$D$349+Reference!$D$349","v":22},-2.87E-2,-1.35E-2,-1.6999999999999999E-3,-0.23680000000000001,-4.4900000000000002E-2,{"$f":"SUM('Redeck Deflections'!$W$13:$AA$13)","v":-0.3256},{"$f":"IF('Redeck Deflections'!$AB$13<0,MROUND(ABS('Redeck Deflections'!$AB$13),0.125),MROUND('Redeck Deflections'!$AB$13,0.125)*-1)","v":0.375},1.2]
[null,null,null,null,null,null,null,1.3,{"$f":"'Redeck Deflections'!$D$6*0.3","v":33},{"$f":"Reference!$D$350+Reference!$D$349","v":33},-3.6999999999999998E-2,-1.7500000000000002E-2,-2.2000000000000001E-3,-0.30559999999999998,-5.8799999999999998E-2,{"$f":"SUM('Redeck Deflections'!$K$14:$O$14)","v":-0.42109999999999997},{"$f":"IF('Redeck Deflections'!$P$14<0,MROUND(ABS('Redeck Deflections'!$P$14),0.125),MROUND('Redeck Deflections'!$P$14,0.125)*-1)","v":0.375},1.3,null,1.3,{"$f":"'Redeck Deflections'!$D$6*0.3","v":33},{"$f":"Reference!$D$350+Reference!$D$349","v":33},-3.6999999999999998E-2,-1.7500000000000002E-2,-2.2000000000000001E-3,-0.30559999999999998,-5.8799999999999998E-2,{"$f":"SUM('Redeck Deflections'!$W$14:$AA$14)","v":-0.42109999999999997},{"$f":"IF('Redeck Deflections'!$AB$14<0,MROUND(ABS('Redeck Deflections'!$AB$14),0.125),MROUND('Redeck Deflections'!$AB$14,0.125)*-1)","v":0.375},1.3]
[null,null,null,null,null,null,null,1.4,{"$f":"'Redeck Deflections'!$D$6*0.4","v":44},{"$f":"Reference!$D$351+Reference!$D$349","v":44},-3.9800000000000002E-2,-1.8800000000000001E-2,-2.3999999999999998E-3,-0.32840000000000003,-6.4299999999999996E-2,{"$f":"SUM('Redeck Deflections'!$K$15:$O$15)","v":-0.45369999999999999},{"$f":"IF('Redeck Deflections'!$P$15<0,MROUND(ABS('Redeck Deflections'!$P$15),0.125),MROUND('Redeck Deflections'!$P$15,0.125)*-1)","v":0.5},1.4,null,1.4,{"$f":"'Redeck Deflections'!$D$6*0.4","v":44},{"$f":"Reference!$D$351+Reference!$D$349","v":44},-3.9800000000000002E-2,-1.8800000000000001E-2,-2.3999999999999998E-3,-0.32840000000000003,-6.4299999999999996E-2,{"$f":"SUM('Redeck Deflections'!$W$15:$AA$15)","v":-0.45369999999999999},{"$f":"IF('Redeck Deflections'!$AB$15<0,MROUND(ABS('Redeck Deflections'!$AB$15),0.125),MROUND('Redeck Deflections'!$AB$15,0.125)*-1)","v":0.5},1.4]
[null,null,null,null,null,null,null,1.5,{"$f":"'Redeck Deflections'!$D$6*0.5","v":55},{"$f":"Reference!$D$352+Reference!$D$349","v":55},-3.7100000000000001E-2,-1.7399999999999999E-2,-2.2000000000000001E-3,-0.30530000000000002,-6.1400000000000003E-2,{"$f":"SUM('Redeck Deflections'!$K$16:$O$16)","v":-0.4234},{"$f":"IF('Redeck Deflections'!$P$16<0,MROUND(ABS('Redeck Deflections'!$P$16),0.125),MROUND('Redeck Deflections'!$P$16,0.125)*-1)","v":0.375},1.5,null,1.5,{"$f":"'Redeck Deflections'!$D$6*0.5","v":55},{"$f":"Reference!$D$352+Reference!$D$349","v":55},-3.7100000000000001E-2,-1.7399999999999999E-2,-2.2000000000000001E-3,-0.30530000000000002,-6.1400000000000003E-2,{"$f":"SUM('Redeck Deflections'!$W$16:$AA$16)","v":-0.4234},{"$f":"IF('Redeck Deflections'!$AB$16<0,MROUND(ABS('Redeck Deflections'!$AB$16),0.125),MROUND('Redeck Deflections'!$AB$16,0.125)*-1)","v":0.375},1.5]
[null,null,null,null,null,null,null,1.6,{"$f":"'Redeck Deflections'!$D$6*0.6","v":66},{"$f":"Reference!$D$353+Reference!$D$349","v":66},-2.9700000000000001E-2,-1.3899999999999999E-2,-1.8E-3,-0.24390000000000001,-5.0799999999999998E-2,{"$f":"SUM('Redeck Deflections'!$K$17:$O$17)","v":-0.34010000000000001},{"$f":"IF('Redeck Deflections'!$P$17<0,MROUND(ABS('Redeck Deflections'!$P$17),0.125),MROUND('Redeck Deflections'!$P$17,0.125)*-1)","v":0.375},1.6,null,1.6,{"$f":"'Redeck Deflections'!$D$6*0.6","v":66},{"$f":"Reference!$D$353+Reference!$D$349","v":66},-2.9700000000000001E-2,-1.3899999999999999E-2,-1.8E-3,-0.24390000000000001,-5.0799999999999998E-2,{"$f":"SUM('Redeck Deflections'!$W$17:$AA$17)","v":-0.34010000000000001},{"$f":"IF('Redeck Deflections'!$AB$17<0,MROUND(ABS('Redeck Deflections'!$AB$17),0.125),MROUND('Redeck Deflections'!$AB$17,0.125)*-1)","v":0.375},1.6]
[null,null,null,null,null,null,null,1.7,{"$f":"'Redeck Deflections'!$D$6*0.7","v":77},{"$f":"Reference!$D$354+Reference!$D$349","v":77},-1.95E-2,-9.1000000000000004E-3,-1.1000000000000001E-3,-0.15989999999999999,-3.4799999999999998E-2,{"$f":"SUM('Redeck Deflections'!$K$18:$O$18)","v":-0.22439999999999999},{"$f":"IF('Redeck Deflections'!$P$18<0,MROUND(ABS('Redeck Deflections'!$P$18),0.125),MROUND('Redeck Deflections'!$P$18,0.125)*-1)","v":0.25},1.7,null,1.7,{"$f":"'Redeck Deflections'!$D$6*0.7","v":77},{"$f":"Reference!$D$354+Reference!$D$349","v":77},-1.95E-2,-9.1000000000000004E-3,-1.1000000000000001E-3,-0.15989999999999999,-3.4799999999999998E-2,{"$f":"SUM('Redeck Deflections'!$W$18:$AA$18)","v":-0.22439999999999999},{"$f":"IF('Redeck Deflections'!$AB$18<0,MROUND(ABS('Redeck Deflections'!$AB$18),0.125),MROUND('Redeck Deflections'!$AB$18,0.125)*-1)","v":0.25},1.7]
[null,null,null,null,null,null,null,1.8,{"$f":"'Redeck Deflections'!$D$6*0.8","v":88},{"$f":"Reference!$D$355+Reference!$D$349","v":88},-9.4000000000000004E-3,-4.4000000000000003E-3,-5.0000000000000001E-4,-7.6399999999999996E-2,-1.6899999999999998E-2,{"$f":"SUM('Redeck Deflections'!$K$19:$O$19)","v":-0.1076},{"$f":"IF('Redeck Deflections'!$P$19<0,MROUND(ABS('Redeck Deflections'!$P$19),0.125),MROUND('Redeck Deflections'!$P$19,0.125)*-1)","v":0.125},1.8,null,1.8,{"$f":"'Redeck Deflections'!$D$6*0.8","v":88},{"$f":"Reference!$D$355+Reference!$D$349","v":88},-9.4000000000000004E-3,-4.4000000000000003E-3,-5.0000000000000001E-4,-7.6399999999999996E-2,-1.6899999999999998E-2,{"$f":"SUM('Redeck Deflections'!$W$19:$AA$19)","v":-0.1076},{"$f":"IF('Redeck Deflections'!$AB$19<0,MROUND(ABS('Redeck Deflections'!$AB$19),0.125),MROUND('Redeck Deflections'!$AB$19,0.125)*-1)","v":0.125},1.8]
[null,null,null,null,null,null,null,1.9,{"$f":"'Redeck Deflections'!$D$6*0.9","v":99},{"$f":"Reference!$D$356+Reference!$D$349","v":99},-2.3999999999999998E-3,-1.1000000000000001E-3,-1E-4,-1.9099999999999999E-2,-3.0000000000000001E-3,{"$f":"SUM('Redeck Deflections'!$K$20:$O$20)","v":-2.5699999999999997E-2},{"$f":"IF('Redeck Deflections'!$P$20<0,MROUND(ABS('Redeck Deflections'!$P$20),0.125),MROUND('Redeck Deflections'!$P$20,0.125)*-1)","v":0},1.9,null,1.9,{"$f":"'Redeck Deflections'!$D$6*0.9","v":99},{"$f":"Reference!$D$356+Reference!$D$349","v":99},-2.3999999999999998E-3,-1.1000000000000001E-3,-1E-4,-1.9099999999999999E-2,-3.0000000000000001E-3,{"$f":"SUM('Redeck Deflections'!$W$20:$AA$20)","v":-2.5699999999999997E-2},{"$f":"IF('Redeck Deflections'!$AB$20<0,MROUND(ABS('Redeck Deflections'!$AB$20),0.125),MROUND('Redeck Deflections'!$AB$20,0.125)*-1)","v":0},1.9]
{"$rows_left_out":24}
{"sheet":"Deliverables","index":2,"n_rows":38,"n_cols":10,"rows_kept":38,"cut":false,"hidden":false,"merged":[[3,2,3,4],[3,6,3,8],[0,2,2,8],[0,9,2,15]]}
[null,null,"Dead Load Deflections Summary",null,null,null,null,null,null,"Copy and Paste these Values into a Separate Spreadsheet for the Electronic Deliverables"]
[]
[]
[null,null,"Exterior Girder",null,null,null,"Interior Girder"]
[null,null,"Decimal Inches","Nearest 1/8\"","Tenth point",null,"Decimal Inches","Nearest 1/8\"","Tenth point"]
[null,null,0,0,1,null,0,0,1]
[null,null,-0.17810000000000001,0.125,1.1000000000000001,null,-0.17810000000000001,0.125,1.1000000000000001]
[null,null,-0.3256,0.375,1.2,null,-0.3256,0.375,1.2]
[null,null,-0.42109999999999997,0.375,1.3,null,-0.42109999999999997,0.375,1.3]
[null,null,-0.45369999999999999,0.5,1.4,null,-0.45369999999999999,0.5,1.4]
[null,null,-0.4234,0.375,1.5,null,-0.4234,0.375,1.5]
[null,null,-0.34010000000000001,0.375,1.6,null,-0.34010000000000001,0.375,1.6]
[null,null,-0.22439999999999999,0.25,1.7,null,-0.22439999999999999,0.25,1.7]
[null,null,-0.1076,0.125,1.8,null,-0.1076,0.125,1.8]
[null,null,-2.5699999999999997E-2,0,1.9,null,-2.5699999999999997E-2,0,1.9]
[null,null,0,0,2,null,0,0,2]
[null,null,0,0,2,null,0,0,2]
[null,null,-8.0600000000000005E-2,0.125,2.1,null,-8.0600000000000005E-2,0.125,2.1]
[null,null,-0.24479999999999999,0.25,2.2000000000000002,null,-0.24479999999999999,0.25,2.2000000000000002]
[null,null,-0.43390000000000001,0.375,2.2999999999999998,null,-0.43390000000000001,0.375,2.2999999999999998]
{"$rows_left_out":19}
{"sheet":"Reference","index":3,"n_rows":435,"n_cols":24,"rows_kept":435,"cut":false,"hidden":false,"merged":[[1,0,14,0],[17,1,17,11],[17,13,17,23],[18,6,18,7],[18,9,18,10],[18,18,18,19],[18,21,18,22],[17,0,41,0],[1,1,1,11],[1,13,1,23],[2,6,2,7],[2,9,2,10],[2,18,2,19],[2,21,2,22],[44,1,44,11],[45,6,45,7],[45,9,45,10],[44,0,79,0],[44,13,44,23],[45,18,45,19],[45,21,45,22],[131,0,188,0],[82,0,128,0],[131,1,131,11],[131,13,131,23],[132,6,132,7],[132,9,132,10],[132,18,132,19],[132,21,132,22],[82,1,82,11],[82,13,82,23],[83,6,83,7],[83,9,83,10],[83,18,83,19],[83,21,83,22],[191,0,259,0],[262,1,262,11],[262,13,262,23],[263,6,263,7],[263,9,263,10],[263,18,263,19],[263,21,263,22],[262,0,341,0],[191,1,191,11],[191,13,191,23],[192,6,192,7],[192,9,192,10],[192,18,192,19],[192,21,192,22],[344,0,434,0],[344,1,344,11],[344,13,344,23],[345,6,345,7],[345,9,345,10],[345,18,345,19],[345,21,345,22]]}
[]
["1 Span","EXTERIOR GIRDERS",null,null,null,null,null,null,null,null,null,null,null,"INTERIOR GIRDERS"]
[null,null,null,null,"Girder","Intermediate diaphragms","Concrete",null,"Barrier","Total DL Deflection",null,null,null,null,null,null,"Girder","Intermediate diaphragms","Concrete",null,"Barrier","Total DL Deflection"]
[null,"Tenth point"," Location"," Distance"," YDL-s1- Load Case 1 - Self Load (Stage1:D,DC)"," YDL-s1- Load Case 2 - Add'l Self Load (In Force/Length) (Stage 1:D,DC)"," YDL-s1- Load Case 3 - Haunch Load (Stage1:D,DC)"," YDL-s1- Load Case 4 - Concrete Deck Load (Stage1:D,DC)"," YDL-s2- Load Case 1 - Parapet Loads(DL2 - Barriers & Curbs: Stage 2:D,D~","Decimal Inches","Nearest 1/8\"","Tenth point",null,"Tenth point"," Location"," Distance"," YDL-s1- Load Case 1 - Self Load (Stage1:D,DC)"," YDL-s1- Load Case 2 - Add'l Self Load (In Force/Length) (Stage 1:D,DC)"," YDL-s1- Load Case 3 - Haunch Load (Stage1:D,DC)"," YDL-s1- Load Case 4 - Concrete Deck Load (Stage1:D,DC)"," YDL-s2- Load Case 1 - Parapet Loads(DL2 - Barriers & Curbs: Stage 2:D,D~","Decimal Inches","Nearest 1/8\"","Tenth point"]
[null,1,0,0,"Copy and Paste Values from Virtis",null,null,null,null,{"$f":"SUM('Redeck Deflections'!$K$11:$O$11)","v":0},{"$f":"IF('Redeck Deflections'!$P$11<0,MROUND(ABS('Redeck Deflections'!$P$11),0.125),MROUND('Redeck Deflections'!$P$11,0.125)*-1)","v":0},1,null,1,0,0,"Copy and Paste Values from Virtis",null,null,null,null,{"$f":"SUM('Redeck Deflections'!$W$11:$AA$11)","v":0},{"$f":"IF('Redeck Deflections'!$AB$11<0,MROUND(ABS('Redeck Deflections'!$AB$11),0.125),MROUND('Redeck Deflections'!$AB$11,0.125)*-1)","v":0},1]
[null,1.1000000000000001,{"$f":"'Redeck Deflections'!$D$6*0.1","v":11},{"$f":"Reference!$C$349","v":11},null,null,null,null,null,{"$f":"SUM('Redeck Deflections'!$K$12:$O$12)","v":-0.17810000000000001},{"$f":"IF('Redeck Deflections'!$P$12<0,MROUND(ABS('Redeck Deflections'!$P$12),0.125),MROUND('Redeck Deflections'!$P$12,0.125)*-1)","v":0.125},1.1000000000000001,null,1.1000000000000001,{"$f":"'Redeck Deflections'!$D$6*0.1","v":11},{"$f":"Reference!$C$349","v":11},null,null,null,null,null,{"$f":"SUM('Redeck Deflections'!$W$12:$AA$12)","v":-0.17810000000000001},{"$f":"IF('Redeck Deflections'!$AB$12<0,MROUND(ABS('Redeck Deflections'!$AB$12),0.125),MROUND('Redeck Deflections'!$AB$12,0.125)*-1)","v":0.125},1.1000000000000001]
[null,1.2,{"$f":"'Redeck Deflections'!$D$6*0.2","v":22},{"$f":"Reference!$D$349+Reference!$D$349","v":22},null,null,null,null,null,{"$f":"SUM('Redeck Deflections'!$K$13:$O$13)","v":-0.3256},{"$f":"IF('Redeck Deflections'!$P$13<0,MROUND(ABS('Redeck Deflections'!$P$13),0.125),MROUND('Redeck Deflections'!$P$13,0.125)*-1)","v":0.375},1.2,null,1.2,{"$f":"'Redeck Deflections'!$D$6*0.2","v":22},{"$f":"Reference!$D$349+Reference!$D$349","v":22},null,null,null,null,null,{"$f":"SUM('Redeck Deflections'!$W$13:$AA$13)","v":-0.3256},{"$f":"IF('Redeck Deflections'!$AB$13<0,MROUND(ABS('Redeck Deflections'!$AB$13),0.125),MROUND('Redeck Deflections'!$AB$13,0.125)*-1)","v":0.375},1.2]
[null,1.3,{"$f":"'Redeck Deflections'!$D$6*0.3","v":33},{"$f":"Reference!$D$350+Reference!$D$349","v":33},null,null,null,null,null,{"$f":"SUM('Redeck Deflections'!$K$14:$O$14)","v":-0.42109999999999997},{"$f":"IF('Redeck Deflections'!$P$14<0,MROUND(ABS('Redeck Deflections'!$P$14),0.125),MROUND('Redeck Deflections'!$P$14,0.125)*-1)","v":0.375},1.3,null,1.3,{"$f":"'Redeck Deflections'!$D$6*0.3","v":33},{"$f":"Reference!$D$350+Reference!$D$349","v":33},null,null,null,null,null,{"$f":"SUM('Redeck Deflections'!$W$14:$AA$14)","v":-0.42109999999999997},{"$f":"IF('Redeck Deflections'!$AB$14<0,MROUND(ABS('Redeck Deflections'!$AB$14),0.125),MROUND('Redeck Deflections'!$AB$14,0.125)*-1)","v":0.375},1.3]
[null,1.4,{"$f":"'Redeck Deflections'!$D$6*0.4","v":44},{"$f":"Reference!$D$351+Reference!$D$349","v":44},null,null,null,null,null,{"$f":"SUM('Redeck Deflections'!$K$15:$O$15)","v":-0.45369999999999999},{"$f":"IF('Redeck Deflections'!$P$15<0,MROUND(ABS('Redeck Deflections'!$P$15),0.125),MROUND('Redeck Deflections'!$P$15,0.125)*-1)","v":0.5},1.4,null,1.4,{"$f":"'Redeck Deflections'!$D$6*0.4","v":44},{"$f":"Reference!$D$351+Reference!$D$349","v":44},null,null,null,null,null,{"$f":"SUM('Redeck Deflections'!$W$15:$AA$15)","v":-0.45369999999999999},{"$f":"IF('Redeck Deflections'!$AB$15<0,MROUND(ABS('Redeck Deflections'!$AB$15),0.125),MROUND('Redeck Deflections'!$AB$15,0.125)*-1)","v":0.5},1.4]
[null,1.5,{"$f":"'Redeck Deflections'!$D$6*0.5","v":55},{"$f":"Reference!$D$352+Reference!$D$349","v":55},null,null,null,null,null,{"$f":"SUM('Redeck Deflections'!$K$16:$O$16)","v":-0.4234},{"$f":"IF('Redeck Deflections'!$P$16<0,MROUND(ABS('Redeck Deflections'!$P$16),0.125),MROUND('Redeck Deflections'!$P$16,0.125)*-1)","v":0.375},1.5,null,1.5,{"$f":"'Redeck Deflections'!$D$6*0.5","v":55},{"$f":"Reference!$D$352+Reference!$D$349","v":55},null,null,null,null,null,{"$f":"SUM('Redeck Deflections'!$W$16:$AA$16)","v":-0.4234},{"$f":"IF('Redeck Deflections'!$AB$16<0,MROUND(ABS('Redeck Deflections'!$AB$16),0.125),MROUND('Redeck Deflections'!$AB$16,0.125)*-1)","v":0.375},1.5]
[null,1.6,{"$f":"'Redeck Deflections'!$D$6*0.6","v":66},{"$f":"Reference!$D$353+Reference!$D$349","v":66},null,null,null,null,null,{"$f":"SUM('Redeck Deflections'!$K$17:$O$17)","v":-0.34010000000000001},{"$f":"IF('Redeck Deflections'!$P$17<0,MROUND(ABS('Redeck Deflections'!$P$17),0.125),MROUND('Redeck Deflections'!$P$17,0.125)*-1)","v":0.375},1.6,null,1.6,{"$f":"'Redeck Deflections'!$D$6*0.6","v":66},{"$f":"Reference!$D$353+Reference!$D$349","v":66},null,null,null,null,null,{"$f":"SUM('Redeck Deflections'!$W$17:$AA$17)","v":-0.34010000000000001},{"$f":"IF('Redeck Deflections'!$AB$17<0,MROUND(ABS('Redeck Deflections'!$AB$17),0.125),MROUND('Redeck Deflections'!$AB$17,0.125)*-1)","v":0.375},1.6]
[null,1.7,{"$f":"'Redeck Deflections'!$D$6*0.7","v":77},{"$f":"Reference!$D$354+Reference!$D$349","v":77},null,null,null,null,null,{"$f":"SUM('Redeck Deflections'!$K$18:$O$18)","v":-0.22439999999999999},{"$f":"IF('Redeck Deflections'!$P$18<0,MROUND(ABS('Redeck Deflections'!$P$18),0.125),MROUND('Redeck Deflections'!$P$18,0.125)*-1)","v":0.25},1.7,null,1.7,{"$f":"'Redeck Deflections'!$D$6*0.7","v":77},{"$f":"Reference!$D$354+Reference!$D$349","v":77},null,null,null,null,null,{"$f":"SUM('Redeck Deflections'!$W$18:$AA$18)","v":-0.22439999999999999},{"$f":"IF('Redeck Deflections'!$AB$18<0,MROUND(ABS('Redeck Deflections'!$AB$18),0.125),MROUND('Redeck Deflections'!$AB$18,0.125)*-1)","v":0.25},1.7]
[null,1.8,{"$f":"'Redeck Deflections'!$D$6*0.8","v":88},{"$f":"Reference!$D$355+Reference!$D$349","v":88},null,null,null,null,null,{"$f":"SUM('Redeck Deflections'!$K$19:$O$19)","v":-0.1076},{"$f":"IF('Redeck Deflections'!$P$19<0,MROUND(ABS('Redeck Deflections'!$P$19),0.125),MROUND('Redeck Deflections'!$P$19,0.125)*-1)","v":0.125},1.8,null,1.8,{"$f":"'Redeck Deflections'!$D$6*0.8","v":88},{"$f":"Reference!$D$355+Reference!$D$349","v":88},null,null,null,null,null,{"$f":"SUM('Redeck Deflections'!$W$19:$AA$19)","v":-0.1076},{"$f":"IF('Redeck Deflections'!$AB$19<0,MROUND(ABS('Redeck Deflections'!$AB$19),0.125),MROUND('Redeck Deflections'!$AB$19,0.125)*-1)","v":0.125},1.8]
[null,1.9,{"$f":"'Redeck Deflections'!$D$6*0.9","v":99},{"$f":"Reference!$D$356+Reference!$D$349","v":99},null,null,null,null,null,{"$f":"SUM('Redeck Deflections'!$K$20:$O$20)","v":-2.5699999999999997E-2},{"$f":"IF('Redeck Deflections'!$P$20<0,MROUND(ABS('Redeck Deflections'!$P$20),0.125),MROUND('Redeck Deflections'!$P$20,0.125)*-1)","v":0},1.9,null,1.9,{"$f":"'Redeck Deflections'!$D$6*0.9","v":99},{"$f":"Reference!$D$356+Reference!$D$349","v":99},null,null,null,null,null,{"$f":"SUM('Redeck Deflections'!$W$20:$AA$20)","v":-2.5699999999999997E-2},{"$f":"IF('Redeck Deflections'!$AB$20<0,MROUND(ABS('Redeck Deflections'!$AB$20),0.125),MROUND('Redeck Deflections'!$AB$20,0.125)*-1)","v":0},1.9]
[null,2,{"$f":"'Redeck Deflections'!$D$6*1","v":110},{"$f":"Reference!$D$357+Reference!$D$349","v":110},null,null,null,null,null,{"$f":"SUM('Redeck Deflections'!$K$21:$O$21)","v":0},{"$f":"IF('Redeck Deflections'!$P$21<0,MROUND(ABS('Redeck Deflections'!$P$21),0.125),MROUND('Redeck Deflections'!$P$21,0.125)*-1)","v":0},2,null,2,{"$f":"'Redeck Deflections'!$D$6*1","v":110},{"$f":"Reference!$D$357+Reference!$D$349","v":110},null,null,null,null,null,{"$f":"SUM('Redeck Deflections'!$W$21:$AA$21)","v":0},{"$f":"IF('Redeck Deflections'!$AB$21<0,MROUND(ABS('Redeck Deflections'!$AB$21),0.125),MROUND('Redeck Deflections'!$AB$21,0.125)*-1)","v":0},2]
[]
[]
["2 Span","EXTERIOR GIRDERS",null,null,null,null,null,null,null,null,null,null,null,"INTERIOR GIRDERS"]
[null,null,null,null,"Girder","Intermediate diaphragms","Concrete",null,"Barrier","Total DL Deflection",null,null,null,null,null,null,"Girder","Intermediate diaphragms","Concrete",null,"Barrier","Total DL Deflection"]
[null,"Tenth point"," Location"," Distance"," YDL-s1- Load Case 1 - Self Load (Stage1:D,DC)"," YDL-s1- Load Case 2 - Add'l Self Load (In Force/Length) (Stage 1:D,DC)"," YDL-s1- Load Case 3 - Haunch Load (Stage1:D,DC)"," YDL-s1- Load Case 4 - Concrete Deck Load (Stage1:D,DC)"," YDL-s2- Load Case 1 - Parapet Loads(DL2 - Barriers & Curbs: Stage 2:D,D~","Decimal Inches","Nearest 1/8\"","Tenth point",null,"Tenth point"," Location"," Distance"," YDL-s1- Load Case 1 - Self Load (Stage1:D,DC)"," YDL-s1- Load Case 2 - Add'l Self Load (In Force/Length) (Stage 1:D,DC)"," YDL-s1- Load Case 3 - Haunch Load (Stage1:D,DC)"," YDL-s1- Load Case 4 - Concrete Deck Load (Stage1:D,DC)"," YDL-s2- Load Case 1 - Parapet Loads(DL2 - Barriers & Curbs: Stage 2:D,D~","Decimal Inches","Nearest 1/8\"","Tenth point"]
{"$rows_left_out":415}